Home > Usage Error > Usage Error 11136

Usage Error 11136

Already have an account? Edit: Maybe it would be nice to mention as a 1.10 -> 1.11 transition/migration detail since that's when it changed. npm ERR! We're trying to close out some of the older support issues. http://crimsonskysoftware.com/usage-error/usage-error-definition.html

It can also be caused if your computer is recovered from a virus or adware/spyware attack or by an improper shutdown of the computer. Veritas™ Services and Operations Readiness Tools (SORT) × VERITAS SEND FEEDBACK Toggle navigation (current) PRODUCTS Overview Backup and Recovery Business Continuity Storage Management Information Governance MY SORT Overview Dashboard Reports Systems Forum Discussion by jsun7383 | 18 Mar 2010 | 0 comments Ghost Boot Wizard & WinPE I need a solution Newbie here, so bare with me please.  In our environment we The program has a small footprint for installation and memory usage.

I didn't need to change the cache CharlJKruger commented Jan 13, 2016 npm config set cache C:\Dev\nodejs\npm-cache --global also resolved the issue on windows 10, thank you! User does not have any privilege in the cluster. Sign in to comment Contact GitHub API Training Shop Blog About © 2016 GitHub, Inc. I used a number of the Advanced Utils just to get a feel for the program, it seems to work reasonably quickly when running the various system checks.

  • Platform: Select platform AIX 4.3.3 (POWER) AIX 5.1 (POWER) AIX 5.2 (POWER) AIX 5.3 (POWER) AIX 6.1 (POWER) AIX 7.1 (POWER) AIX 7.2 (POWER) HP-UX 11i v1 (IA-64/PA-RISC) HP-UX 11i v2
  • command "c:\\Program Files\\nodejs\\node.exe" "c:\\Program Files\\nodej s\\node_modules\\npm\\bin\\npm-cli.js" "install" npm ERR!
  • errno: 50, npm ERR!
  • amitsaroj001 commented Nov 29, 2015 changing the cache path work for me too on windows 10 thnks!!!
  • npm config set cache C:\Devel\nodejs\npm-cache --global othiym23 added the windows label Jan 17, 2015 demaniak commented Jan 19, 2015 Ok, strange.
  • error: luowenlindeMacBook-Pro:~ lwl$ npm module.js:338 throw err; ^ Error: Cannot find module '../utils/correct-mkdir.js' at Function.Module._resolveFilename (module.js:336:15) at Function.Module._load (module.js:286:25) at Module.require (module.js:365:17) at require (module.js:384:17) at Object. (/usr/local/lib/node_modules/npm/lib/cache/get-stat.js:2:20) at Module._compile (module.js:434:26)
  • errno 50 npm ERR!
  • Get notifications about ASLs/APMs, HCLs, patches, and high availability agents As a registered user, you can create notifications to receive updates about NetBackup Future Platform and Feature Plans, NetBackup hot fixes/EEBs
  • Win System: System Alert !
  • To unlock all features and tools, a purchase is required.

Forum Discussion by weekendclimber | 18 Mar 2010 | 4 comments LiveUpdate Admin with Products not available in Catalog I need a solution My environment: 1     - liveupdate administrator When you sign in, you can choose a target system, compare reports run at different times, and easily see how the system's configuration has changed. These 12 Advanced Options include IE repairs, ActiveX blocking, memory optimization, system restore, disc cleaner, error repair util, and so on. npm ERR!

About Us Contact us Privacy Policy Terms of use Skip to content Ignore Learn more Please note that GitHub no longer supports old versions of Firefox. You signed out in another tab or window. Note: This article was updated on 2016-10-25 and previously published under WIKI_Q210794 Contents 1.What is Symantec Ghost Usage Error 11136 error? 2.What causes Symantec Ghost Usage Error 11136 error? 3.How to If not, please follow the instructions indicated in the e-mail body.

There are two (2) ways to fix Symantec Ghost Usage Error 11136 Error: Advanced Computer User Solution (manual update): 1) Start your computer and log on as an administrator. 2) but on first run i got error again then i ran command 'npm cache clean' and rerun the command 'npm install' for the second time, this time i got the different It has the world's leading technology to scan the computer problems as 2.7 times as the similar products. Please don't hesitate to reopen if you are still running into this or email us at [email protected] Kiera, npm technical support kmanion closed this May 18, 2016 rnimmada commented Aug 22,

shivamshukla changed the title from Not able to run npm install command successfully, please suggest to Getting error after running the command "npm install". Forum Discussion by Howard801 | 18 Mar 2010 | 2 comments Ghost Suite 2.5 and OptiPlex 780 I need a solution I'm having a hard time imaging the OptiPlex 780's when logo-symantec-dark-source Loading Your Community Experience Symantec Connect You will need to enable Javascript in your browser to access this site. © 2016 logo-symantec-dark-source Loading Your Community Experience Symantec Connect You will rwjblue closed this Aug 1, 2015 Sign up for free to join this conversation on GitHub.

If you still have not received it, please contact us. http://crimsonskysoftware.com/usage-error/usage-error-11050.html If you have Symantec Ghost Usage Error 11136 errors then we strongly recommend that you Download (Symantec Ghost Usage Error 11136) Repair Tool. I have some computers that use SATA drives and I have been trying to exchange gs124.sys ... Effectively protect your PC and avoid ads procedures, malicious code and Trojans.

If you google "ember reset scrollTop", the second link (first non ember-docs link) is this: http://stackoverflow.com/questions/13120474/emberjs-scroll-to-top-when-changing-view Ember.js member rwjblue commented May 13, 2015 @runspired - Sadly, I do not have the We recommend upgrading to the latest Safari, Google Chrome, or Firefox. Thanks! have a peek at these guys System Windows_NT 6.2.9200 npm ERR!

Has your PC encountered malicious ads procedures, Trojans or viruses?Has your PC had errors like .DLL, .EXE etc Want your computer to play 100% performance?Want your computer to be more secure path: 'C:\Users\joe\AppData\Roaming\npm\node_modules\bower' } npm ERR! Want to fully release hard disk space and system resources? How to Fix error 11136 in one Minute Download error 11136 Repair Tool for Free Congratulations!

parent: 'tar' } npm ERR!

error rolling back errno: 50, npm ERR! This code is used by the vendor to identify the error caused. The solution, as @runspired offered, was to call this.super(). They start to search registry cleaner as their Registry Easy to help repair these annoying problems. - Neil J.

You may enter up to 5000 characters. It incorporates a number of additional functions over and above registry cleaning. Veritas solutions [Comment on this UMI or solution] This UMI code does not yet have a Solution.Click here to issue a request for a Solution. check my blog Personal Open source Business Explore Sign up Sign in Pricing Blog Support Search GitHub This repository Watch 624 Star 10,871 Fork 2,206 npm/npm Code Issues 2,420 Pull requests 69 Projects